1,2-Cyclohexanedione dioxime

Gas phase thermochemistry data

Data compiled by: Hussein Y. Afeefy, Joel F. Liebman, and Stephen E. Stein

Quantity Value Units Method Reference Comment
Δfgas-69.66kJ/molCcbBrent, 1963

References

Brent, 1963
Brent, C.R., A thermochemical study of the C=N and N-O bonds exergies in tetramethylene furoxan and cyclohexanedione dioxime, Ph.D. Thesis for Tulane University, 1963, 1-71. [all data]