9-Oxabicyclo[6.1.0]nonane, cis-

Phase change data

Data compiled as indicated in comments:
ALS - Hussein Y. Afeefy, Joel F. Liebman, and Stephen E. Stein
DRB - Donald R. Burgess, Jr.

Quantity Value Units Method Reference Comment
Δsub47.4 ± 1.0kJ/molCKozina, Timofeeva, et al., 1988ALS
Δsub47.4kJ/molN/AKozina, Timofeeva, et al., 1988DRB

References

Kozina, Timofeeva, et al., 1988
Kozina, M.P.; Timofeeva, L.P.; Luk'Yanova, V.A.; Pimenova, S.M.; Kas'yan, L.I., Enthalpies of formation and some alicyclic epoxy compounds, Russ. J. Phys. Chem. (Engl. Transl.), 1988, 62, 609-612. [all data]