1,5-Hexadiene, 3,4-dimethyl-

Phase change data

Data compiled by: Thermodynamics Research Center, NIST Boulder Laboratories, Chris Muzny director

Quantity Value Units Method Reference Comment
Tboil374.95KN/AHenne, Chanan, et al., 1941Uncertainty assigned by TRC = 0.5 K

In addition to the Thermodynamics Research Center (TRC) data available from this site, much more physical and chemical property data is available from the following TRC products:

References

Henne, Chanan, et al., 1941
Henne, A.L.; Chanan, H.H.; Turk, A., Olefins and Diolefins from Allylic Chlorides, J. Am. Chem. Soc., 1941, 63, 3474-6. [all data]