Pentaethylene glycol

Phase change data

Data compiled by: Thermodynamics Research Center, NIST Boulder Laboratories, Chris Muzny director

Quantity Value Units Method Reference Comment
Tfus264.45KN/AGallaugher and Hibbert, 1936Uncertainty assigned by TRC = 0.7 K
Quantity Value Units Method Reference Comment
Tc751.KN/AStephens and Tamplin, 1979Uncertainty assigned by TRC = 20. K; TC data from Union Carbide Corp.

In addition to the Thermodynamics Research Center (TRC) data available from this site, much more physical and chemical property data is available from the following TRC products:

References

Gallaugher and Hibbert, 1936
Gallaugher, A.F.; Hibbert, H., Studies on reactions relating to carbohydrates and polysaccharides: xlix molecular weight, molar refraction, freezing point and other properties of the polyethylene glycols and their derivatives, J. Am. Chem. Soc., 1936, 58, 813. [all data]

Stephens and Tamplin, 1979
Stephens, M.A.; Tamplin, W.S., Saturated Liquid SPecific Heats of Ethylene GLycol Homologues, J. Chem. Eng. Data, 1979, 24, 81-2. [all data]