3,5-Dimethyl-4-propyl-1H-pyrrole-2-carboxylic acid ethyl ester

Condensed phase thermochemistry data

Data compiled by: Hussein Y. Afeefy, Joel F. Liebman, and Stephen E. Stein

Quantity Value Units Method Reference Comment
Δcsolid-1641.60 ± 0.51kcal/molCcbStern and Klebs, 1933Reanalyzed by Cox and Pilcher, 1970, Original value = -1645.3 kcal/mol; Heat of combustion at 288 K

References

Stern and Klebs, 1933
Stern, A.; Klebs, G., Calorimetrische Bestimmungen bei einfachen und mehrkernigen Pyrrolderivaten, Ann., 1933, 504, 287-297. [all data]

Cox and Pilcher, 1970
Cox, J.D.; Pilcher, G., Thermochemistry of Organic and Organometallic Compounds, Academic Press, New York, 1970, 1-636. [all data]