1-Propene, 1,1'-oxybis-, (E,Z)-

Reaction thermochemistry data

Data compiled by: Hussein Y. Afeefy, Joel F. Liebman, and Stephen E. Stein

Individual Reactions

1-Propene, 1,1'-oxybis-, (E,Z)- = 1-Propene, 1,1'-oxybis-, (Z,Z)-

By formula: C6H10O = C6H10O

Quantity Value Units Method Reference Comment
Δr-2.9 ± 0.3kJ/molEqkTaskinen and Virtanen, 1977liquid phase; solvent: Cyclohexane
Δr-2.0 ± 0.1kJ/molEqkTaskinen and Virtanen, 1977gas phase; solvent: Cyclohexane; Gas phase isomerization

1-Propene, 1,1'-oxybis-, (E,E)- = 1-Propene, 1,1'-oxybis-, (E,Z)-

By formula: C6H10O = C6H10O

Quantity Value Units Method Reference Comment
Δr-2.3 ± 0.4kJ/molEqkTaskinen and Virtanen, 1977gas phase; solvent: Cyclohexane; Gas phase isomerization
Δr-1.7 ± 0.3kJ/molEqkTaskinen and Virtanen, 1977liquid phase; solvent: Cyclohexane

References

Taskinen and Virtanen, 1977
Taskinen, E.; Virtanen, R., Thermocynamics of vinyl ethers. 19. Alkyl-substituted divinyl ethers, J. Org. Chem., 1977, 42, 1443-1449. [all data]