Acetophenone, 2,2,2-triphenyl-

Condensed phase thermochemistry data

Data compiled by: Hussein Y. Afeefy, Joel F. Liebman, and Stephen E. Stein

Quantity Value Units Method Reference Comment
Δcsolid-13310.kJ/molCcbWieland, Heymann, et al., 1934Corresponding Δfsolid = 230. kJ/mol (simple calculation by NIST; no Washburn corrections)

References

Wieland, Heymann, et al., 1934
Wieland, H.; Heymann, K.; Tsatsas, T.; Juchum, D.; Varvoglis, G.; Labriola, G.; Dobbelstein, O.; Boyd-Barrett, H.S., Uber das Auftreten freier Radikale bei chemischen Reaktionen. VIII, Ann., 1934, 514, 145-181. [all data]