1-Methyl-bicyclo[3.1.0]-hexane

Phase change data

Data compiled as indicated in comments:
DRB - Donald R. Burgess, Jr.
AC - William E. Acree, Jr., James S. Chickos

Quantity Value Units Method Reference Comment
Δvap34.7kJ/molN/AKozina, Timofeeva, et al., 1971DRB

Enthalpy of vaporization

ΔvapH (kJ/mol) Temperature (K) Method Reference Comment
34.0327.AStephenson and Malanowski, 1987Based on data from 312. - 362. K.; AC

Condensed phase thermochemistry data

Data compiled by: Hussein Y. Afeefy, Joel F. Liebman, and Stephen E. Stein

Quantity Value Units Method Reference Comment
Δfliquid-7.93 ± 0.30kcal/molCcbKozina, Timofeeva, et al., 1971
Quantity Value Units Method Reference Comment
Δcliquid-1060.32 ± 0.28kcal/molCcbKozina, Timofeeva, et al., 1971Corresponding Δfliquid = -7.93 kcal/mol (simple calculation by NIST; no Washburn corrections)

References

Kozina, Timofeeva, et al., 1971
Kozina, M.P.; Timofeeva, L.P.; Skuratov, S.M.; Belikova, N.A.; Milvitskaya, E.M.; Plate, A.F., The enthalpies of combustion of some bicyclic compounds, J. Chem. Thermodyn., 1971, 3, 563-570. [all data]

Stephenson and Malanowski, 1987
Stephenson, Richard M.; Malanowski, Stanislaw, Handbook of the Thermodynamics of Organic Compounds, 1987, https://doi.org/10.1007/978-94-009-3173-2 . [all data]