2(3H)-Furanone, dihydro-5,5-dimethyl-4-(3-oxobutyl)-

Condensed phase thermochemistry data

Data compiled by: Hussein Y. Afeefy, Joel F. Liebman, and Stephen E. Stein

Quantity Value Units Method Reference Comment
Δfsolid-773.2kJ/molCcbHarispe, 1936see Harispe, 1936, 2
Quantity Value Units Method Reference Comment
Δcsolid-5451.3kJ/molCcbHarispe, 1936see Harispe, 1936, 2; Corresponding Δfsolid = -770.3 kJ/mol (simple calculation by NIST; no Washburn corrections)

References

Harispe, 1936
Harispe, J.-V., Chimie Organique - Sur l'acide dimethyl-2,4-phenylacetique Sa preparation a partir de l'acide pinonique, Compt. Rend., 1936, 202, 1591-1593. [all data]

Harispe, 1936, 2
Harispe, J.-V., Contribution a l'etude de l'acide dimethyl-2.4 phenylacetique et de ses derives, Ann. Chim., 1936, 6, 249-346. [all data]