3,5,7,9-Tetraoxaundecane

Condensed phase thermochemistry data

Data compiled by: Hussein Y. Afeefy, Joel F. Liebman, and Stephen E. Stein

Quantity Value Units Method Reference Comment
Δfliquid-794.6 ± 1.2kJ/molCcrMansson, 1969
Quantity Value Units Method Reference Comment
Δcliquid-4246.6 ± 1.1kJ/molCcrMansson, 1969Corresponding Δfliquid = -794.62 kJ/mol (simple calculation by NIST; no Washburn corrections)

Gas phase thermochemistry data

Data compiled by: Hussein Y. Afeefy, Joel F. Liebman, and Stephen E. Stein

Quantity Value Units Method Reference Comment
Δfgas-741.0 ± 1.4kJ/molCcrMansson, 1969

References

Mansson, 1969
Mansson, M., Non-bonded oxygen-oxygen interactions in straight-chain compounds, J. Chem. Thermodyn., 1969, 1, 141-151. [all data]