Ethane, 2-chloro-1-(chloromethoxy)-1,1,2-trifluoro-

Phase change data

Data compiled by: William E. Acree, Jr., James S. Chickos

Quantity Value Units Method Reference Comment
Δvap42.4 ± 0.1kJ/molCUchytilová, Majer, et al., 1984

Enthalpy of vaporization

ΔvapH (kJ/mol) Temperature (K) Method Reference
41.2 ± 0.1313.CUchytilová, Majer, et al., 1984
40.1 ± 0.1328.CUchytilová, Majer, et al., 1984
39.0 ± 0.1343.CUchytilová, Majer, et al., 1984
37.8 ± 0.1358.CUchytilová, Majer, et al., 1984

References

Uchytilová, Majer, et al., 1984
Uchytilová, V.; Majer, V.; Svoboda, V.; Hemer, I., Enthalpies of vaporization and cohesive energies of 2-chloro-1,1,2-trifluoroethyl ethyl ether, 2-chloro-1,1,2-trifluoroethyl propyl ether, 2-chloro-1,1,2-trifluoroethyl chloromethyl ether, and 2-chloro-1,1,2-trifluoroethyl difluoromethyl ether, The Journal of Chemical Thermodynamics, 1984, 16, 5, 475-479, https://doi.org/10.1016/0021-9614(84)90205-2 . [all data]