N-Phenethylazetidine

Phase change data

Data compiled as indicated in comments:
DRB - Donald R. Burgess, Jr.
AC - William E. Acree, Jr., James S. Chickos
ALS - Hussein Y. Afeefy, Joel F. Liebman, and Stephen E. Stein

Quantity Value Units Method Reference Comment
Δvap63.2kJ/molN/AKiparisova, Tsvetkova, et al., 1976DRB

Enthalpy of vaporization

ΔvapH (kJ/mol) Temperature (K) Method Reference Comment
62.2317.AStephenson and Malanowski, 1987Based on data from 302. - 333. K. See also Kiparisova, Tsvetkova, et al., 1976.; AC
63.2 ± 0.92303.VKiparisova, Tsvetkova, et al., 1976ALS

References

Kiparisova, Tsvetkova, et al., 1976
Kiparisova, E.G.; Tsvetkova, L.Ya.; Lebedev, B.V., Thermochemistry of N-phenethylazetidine, Russ. J. Phys. Chem. (Engl. Transl.), 1976, 50, 638. [all data]

Stephenson and Malanowski, 1987
Stephenson, Richard M.; Malanowski, Stanislaw, Handbook of the Thermodynamics of Organic Compounds, 1987, https://doi.org/10.1007/978-94-009-3173-2 . [all data]