Benzoyl chloride, 4-fluoro-

Phase change data

Data compiled by: Robert L. Brown and Stephen E. Stein

Reduced pressure boiling point

Tboil (K) Pressure (bar) Reference
355.0.027Farchan Laboratories, 1990
355.0.027PCR Inc., 1990
355.20.027Weast and Grasselli, 1989

References

Farchan Laboratories, 1990
Farchan Laboratories, Research Chemicals Catalog, Farchan Laboratories, Gainesville, FL, 1990, 91. [all data]

PCR Inc., 1990
PCR Inc., Research Chemicals Catalog 1990-1991, PCR Inc., Gainesville, FL, 1990, 1. [all data]

Weast and Grasselli, 1989
CRC Handbook of Data on Organic Compounds, 2nd Editon, Weast,R.C and Grasselli, J.G., ed(s)., CRC Press, Inc., Boca Raton, FL, 1989, 1. [all data]