4-ethyl-2,2-dimethyl-3-hexanone

Phase change data

Data compiled by: Thermodynamics Research Center, NIST Boulder Laboratories, Chris Muzny director

Quantity Value Units Method Reference Comment
Tboil450.KN/ANazarov, 1937Uncertainty assigned by TRC = 6. K
Tboil448.KN/AHaller and Bauer, 1913Uncertainty assigned by TRC = 5. K

In addition to the Thermodynamics Research Center (TRC) data available from this site, much more physical and chemical property data is available from the following TRC products:

References

Nazarov, 1937
Nazarov, I.N., Synthesis of Tertiary Alcohols of the General FOrmulas R3CC(OH)MeCHR2 and R3CC(OH)MeCR3. Action of Methylmagnesium Bromide on Branched Ketones, Chem. Ber., 1937, 70, 599-605. [all data]

Haller and Bauer, 1913
Haller, A.; Bauer, E., Ann. Chim. (Paris), 1913, 29, 8, 313. [all data]