Ethyl meta-tolylacetate
- Formula: C11H14O2
- Molecular weight: 178.2277
- IUPAC Standard InChIKey: RVIWPVAVHHVQIR-UHFFFAOYSA-N
- CAS Registry Number: 40061-55-0
- Chemical structure:
View 3d structure (requires JavaScript / HTML 5) - Other names: Ethyl m-tolylacetate; 3-Methylphenylacetic acid ethyl ester; Ethyl m-methylphenylacetate; m-Tolylacetic acid ethyl ester; Benzeneacetic acid, 3-methyl-, ethyl ester; Ethyl 3-tolyacetate

Phase change data

Data compiled by: Robert L. Brown and Stephen E. Stein
Quantity | Value | Units | Method | Reference | Comment |
---|---|---|---|---|---|
Tboil | 510.7 | K | N/A | Weast and Grasselli, 1989 |

References

Weast and Grasselli, 1989
CRC Handbook of Data on Organic Compounds, 2nd Editon, Weast,R.C and Grasselli, J.G., ed(s)., CRC Press, Inc., Boca Raton, FL, 1989, 1. [all data]