1-(Tert-butyldioxy)-3-pentyloxy-2-propanol

Condensed phase thermochemistry data

Data compiled by: Hussein Y. Afeefy, Joel F. Liebman, and Stephen E. Stein

Quantity Value Units Method Reference Comment
Δfliquid-771.1 ± 4.6kJ/molCcbZaikin, Van Chin Syan, et al., 1972
Quantity Value Units Method Reference Comment
Δcliquid-7666.8 ± 4.6kJ/molCcbZaikin, Van Chin Syan, et al., 1972Corresponding Δfliquid = -771.1 kJ/mol (simple calculation by NIST; no Washburn corrections)

References

Zaikin, Van Chin Syan, et al., 1972
Zaikin, I.D.; Van Chin Syan, Yu.Ya.; Chuchmarev, S.K.; Elagin, G.I., Standard heats of formation of dialkyl peroxides, Russ. J. Phys. Chem. (Engl. Transl.), 1972, 46, 1241-1242. [all data]