Isopropyl mercuric iodide

Reaction thermochemistry data

Data compiled by: José A. Martinho Simões

Individual Reactions

C6H14Hg (l) + Mercury diiodide (cr) = 2C3H7HgI (cr)

By formula: C6H14Hg (l) + HgI2 (cr) = 2C3H7HgI (cr)

Quantity Value Units Method Reference Comment
Δr-65.3 ± 1.7kJ/molRSCMortimer, Pritchard, et al., 1952Please also see Pedley and Rylance, 1977 and Cox and Pilcher, 1970.

References

Mortimer, Pritchard, et al., 1952
Mortimer, C.T.; Pritchard, H.O.; Skinner, H.A., Thermochemistry of metallic alkyls. Part V.?Mercury di-propyl and mercury di-isopropyl, Trans. Faraday Soc., 1952, 48, 220, https://doi.org/10.1039/tf9524800220 . [all data]

Pedley and Rylance, 1977
Pedley, J.B.; Rylance, J., Computer Analysed Thermochemical Data: Organic and Organometallic Compounds, University of Sussex, Brigton, 1977. [all data]

Cox and Pilcher, 1970
Cox, J.D.; Pilcher, G., Thermochemistry of Organic and Organometallic Compounds in Academic Press, New York, 1970. [all data]