N-Trifluoroacetyl glycine

Phase change data

Data compiled by: William E. Acree, Jr., James S. Chickos

Enthalpy of sublimation

ΔsubH (kJ/mol) Temperature (K) Method Reference Comment
98.8288.AStephenson and Malanowski, 1987Based on data from 273. - 393. K. See also Weygand, Klipping, et al., 1960.

References

Stephenson and Malanowski, 1987
Stephenson, Richard M.; Malanowski, Stanislaw, Handbook of the Thermodynamics of Organic Compounds, 1987, https://doi.org/10.1007/978-94-009-3173-2 . [all data]

Weygand, Klipping, et al., 1960
Weygand, Friedrich; Klipping, Gustav; Palm, Dieter, N-Trifluoracetyl-aminosäuren, XVIII. Dampfdruckmessungen anN-TFA-Aminosäuren, -Peptiden und ihren Estern, Chem. Ber., 1960, 93, 11, 2619-2625, https://doi.org/10.1002/cber.19600931129 . [all data]