1,3-Dioxolane, 2-methyl-2-phenyl-
- Formula: C10H12O2
- Molecular weight: 164.2011
- IUPAC Standard InChIKey: GAOQAPRPYXWTFK-UHFFFAOYSA-N
- CAS Registry Number: 3674-77-9
- Chemical structure:
View 3d structure (requires JavaScript / HTML 5) - Other names: Acetophenone ethylene ketal; 2-Methyl-2-phenyl-1,3-dioxolane

Phase change data

Data compiled as indicated in comments:
ALS - Hussein Y. Afeefy, Joel F. Liebman, and Stephen E. Stein
DRB - Donald R. Burgess, Jr.
AC - William E. Acree, Jr., James S. Chickos
Quantity | Value | Units | Method | Reference | Comment |
---|---|---|---|---|---|
ΔsubH° | 81.88 ± 0.50 | kJ/mol | V | Verevkin, Dogan, et al., 1995 | See Beckhaus, Dogan, et al., 1990; ALS |
ΔsubH° | 81.9 | kJ/mol | N/A | Verevkin, Dogan, et al., 1995 | DRB |
Enthalpy of sublimation
ΔsubH (kJ/mol) | Temperature (K) | Method | Reference | Comment |
---|---|---|---|---|
81.9 ± 0.5 | 308. | T | Verevkin, Dogan, et al., 1995 | Based on data from 293. to 324. K.; AC |

Condensed phase thermochemistry data

Data compiled by: Hussein Y. Afeefy, Joel F. Liebman, and Stephen E. Stein
Quantity | Value | Units | Method | Reference | Comment |
---|---|---|---|---|---|
ΔfH°solid | -343.8 ± 2.1 | kJ/mol | Ccr | Verevkin, Dogan, et al., 1995 | See Beckhaus, Dogan, et al., 1990 |
Quantity | Value | Units | Method | Reference | Comment |
ΔcH°solid | -5306.3 ± 2.0 | kJ/mol | Ccr | Verevkin, Dogan, et al., 1995 | See Beckhaus, Dogan, et al., 1990; Corresponding ΔfHºsolid = -343.8 kJ/mol (simple calculation by NIST; no Washburn corrections) |

Gas phase thermochemistry data

Data compiled by: Hussein Y. Afeefy, Joel F. Liebman, and Stephen E. Stein
Quantity | Value | Units | Method | Reference | Comment |
---|---|---|---|---|---|
ΔfH°gas | -261.9 ± 2.2 | kJ/mol | Ccr | Verevkin, Dogan, et al., 1995 | See Beckhaus, Dogan, et al., 1990 |

References

Verevkin, Dogan, et al., 1995
Verevkin, S.P.; Dogan, B.; Hdrich, J.; Beckhaus, H.-D.; Rchardt, C.,
Geminal substituent effects. VIII. Enthalpies of formation of acetals,
J. Prakt. Chem., 1995, 337, 93-98. [all data]
Beckhaus, Dogan, et al., 1990
Beckhaus, H.D.; Dogan, B.; Verevkin, S.; Hadrich, J.; Ruchardt, C.,
Dependence of anomeric stabilization on structure in acetals,
Angew. Chem. Int. Ed. Engl., 1990, 29, 320-321. [all data]