(1α,2α,3α)-1,2-dimethyl-3-(1-methylethyl)cyclopentane

Phase change data

Data compiled by: Thermodynamics Research Center, NIST Boulder Laboratories, Chris Muzny director

Quantity Value Units Method Reference Comment
Tboil435.9KN/APines, Hoffman, et al., 1954Uncertainty assigned by TRC = 2. K

In addition to the Thermodynamics Research Center (TRC) data available from this site, much more physical and chemical property data is available from the following TRC products:

References

Pines, Hoffman, et al., 1954
Pines, H.; Hoffman, N.E.; Ipatieff, V.N., Studies in the Terpene Series XX. The Thermal Isomerization of Pinane at Atmospheric Pressure, J. Am. Chem. Soc., 1954, 76, 4412. [all data]