Dihydro-3,3,4,4-tetraethyl-2,5-furandione

Condensed phase thermochemistry data

Data compiled by: Hussein Y. Afeefy, Joel F. Liebman, and Stephen E. Stein

Quantity Value Units Method Reference Comment
Δcsolid-6781.0 ± 3.4kJ/molCcbVerkade and Hartman, 1933Reanalyzed by Cox and Pilcher, 1970, Original value = -6775.2 kJ/mol; At 288 K; Corresponding Δfsolid = -799.40 kJ/mol (simple calculation by NIST; no Washburn corrections)
Δcsolid-6770.43kJ/molCcbVerkade, Coops, et al., 1925see Verkade and Hartman, 1933; Corresponding Δfsolid = -809.99 kJ/mol (simple calculation by NIST; no Washburn corrections)

References

Verkade and Hartman, 1933
Verkade, P.E.; Hartman, H., Calorimetric researches XXI. Heats of combustion of methyl-, ethyl- and phenyl-substituted succinic acids and of their anhydrides: a. Experimental data, Rec. Trav. Chim. Pays/Bas, 1933, 52, 945-968. [all data]

Cox and Pilcher, 1970
Cox, J.D.; Pilcher, G., Thermochemistry of Organic and Organometallic Compounds, Academic Press, New York, 1970, 1-636. [all data]

Verkade, Coops, et al., 1925
Verkade, P.E.; Coops, J.; Hartman, H., VIII. The paraffin oil method; an aid in the determination of the heats of combustion of difficultly combustible and hygroscopic substances, Recl. Trav. Chim. Pays-Bas, 1925, 44, 206-216. [all data]