N,N'-Bis(2-methyl-2-nitrosobutan-3-one)
- Formula: C10H18N2O2
- Molecular weight: 198.2621
- IUPAC Standard InChIKey: PGJGOOJKCZXYCW-UHFFFAOYSA-N
- CAS Registry Number: 34946-73-1
- Chemical structure:
View 3d structure (requires JavaScript / HTML 5) - Other names: 2-Butanone, 3,3'-azobis[3-methyl-, N,N'-dioxide; Azo-3,3'-bis-2-butanone N,N'-dioxide

Reaction thermochemistry data

Data compiled by: Hussein Y. Afeefy, Joel F. Liebman, and Stephen E. Stein
Individual Reactions
By formula: C10H18N2O2 = 2C5H9NO2
Quantity | Value | Units | Method | Reference | Comment |
---|---|---|---|---|---|
ΔrH° | 18.5 ± 0.2 | kcal/mol | Cm | Keussler and Luttke, 1959 | liquid phase; solvent: Benzene |

References

Keussler and Luttke, 1959
Keussler, V.v.; Luttke, W.,
Spektroskopische Untersuchungen an Nitrosoverbindungen. 3. Mitteilung: Die Dissoziationsenergie der Nitrosodimeren,
Z. Elektrochem., 1959, 63, 614-623. [all data]