3-Ethylsulphinyl-1-propene
- Formula: C5H10OS
- Molecular weight: 118.197
- IUPAC Standard InChIKey: VKINGXBHBOPFOA-UHFFFAOYSA-N
- CAS Registry Number: 34757-40-9
- Chemical structure:
View 3d structure (requires JavaScript / HTML 5) - Permanent link for this species. Use this link for bookmarking this species for future reference.

Gas phase thermochemistry data

Data compiled by: Hussein Y. Afeefy, Joel F. Liebman, and Stephen E. Stein
Quantity | Value | Units | Method | Reference | Comment |
---|---|---|---|---|---|
ΔfH°gas | -104. ± 2. | kJ/mol | Ccr | Mackle and O'Hare, 1961 |

Phase change data

Data compiled by: Hussein Y. Afeefy, Joel F. Liebman, and Stephen E. Stein
Quantity | Value | Units | Method | Reference | Comment |
---|---|---|---|---|---|
ΔvapH° | 71.5 | kJ/mol | V | Mackle and O'Hare, 1961 |

Condensed phase thermochemistry data

Data compiled by: Hussein Y. Afeefy, Joel F. Liebman, and Stephen E. Stein
Quantity | Value | Units | Method | Reference | Comment |
---|---|---|---|---|---|
ΔfH°liquid | -41.8 ± 0.2 | kcal/mol | Ccr | Mackle and O'Hare, 1961 | |
Quantity | Value | Units | Method | Reference | Comment |
ΔcH°liquid | -913.9 ± 0.1 | kcal/mol | Ccr | Mackle and O'Hare, 1961 |

References

Mackle and O'Hare, 1961
Mackle, H.; O'Hare, P.A.G.,
Studies in the thermochemistry of sulphoxides. Part 1 - The gas-phase heats of formation of diethyl, di-n-propyl, t-butyl ethyl, allyl ethyl and diphenyl sulphoxides,
Trans. Faraday Soc., 1961, 57, 2219-2224. [all data]