Carbazol-1(2H)-one, 3,4-dihydro-6-methyl-

Phase change data

Data compiled by: William E. Acree, Jr., James S. Chickos

Enthalpy of fusion

ΔfusH (kJ/mol) Temperature (K) Reference
26.9468.5Correia, Lopes, et al., 2006

References

Correia, Lopes, et al., 2006
Correia, Patrícia; Lopes, Carlos; Piedade, Manuel E.M.; Lourenço, João A.A.; Serrano, Maria L., Solubility and Metastable Zone Width of 1-Keto-1,2,3,4-tetrahydro-6-methylcarbazole in Acetone, J. Chem. Eng. Data, 2006, 51, 4, 1306-1309, https://doi.org/10.1021/je0600552 . [all data]