m-fluoronitrobenzene anion

Reaction thermochemistry data

Data compiled as indicated in comments:
B - John E. Bartmess
M - Michael M. Meot-Ner (Mautner) and Sharon G. Lias

Individual Reactions

C6H4FNO2- + Methyl Alcohol = (C6H4FNO2- • Methyl Alcohol)

By formula: C6H4FNO2- + CH4O = (C6H4FNO2- • CH4O)

Quantity Value Units Method Reference Comment
Δr66.1 ± 8.4kJ/molN/AChowdhury, Grimsrud, et al., 1987gas phase; Free energy affinity at 70°C.; B,M
Quantity Value Units Method Reference Comment
Δr125.J/mol*KPHPMSChowdhury, 1987gas phase; M
Quantity Value Units Method Reference Comment
Δr23. ± 8.4kJ/molTDAsChowdhury, Grimsrud, et al., 1987gas phase; Free energy affinity at 70°C.; B

C6H4FNO2- + Tetrahydrofuran = (C6H4FNO2- • Tetrahydrofuran)

By formula: C6H4FNO2- + C4H8O = (C6H4FNO2- • C4H8O)

Quantity Value Units Method Reference Comment
Δr12. ± 6.7kJ/molIMREChowdhury, Grimsrud, et al., 1987gas phase; Free energy affinity at 35°C.; B

Free energy of reaction

ΔrG° (kJ/mol) T (K) Method Reference Comment
12.308.PHPMSChowdhury, 1987gas phase; M

C6H4FNO2- + Dimethyl Sulfoxide = (C6H4FNO2- • Dimethyl Sulfoxide)

By formula: C6H4FNO2- + C2H6OS = (C6H4FNO2- • C2H6OS)

Quantity Value Units Method Reference Comment
Δr33. ± 6.7kJ/molIMREChowdhury, Grimsrud, et al., 1987gas phase; Free energy affinity at 70°C.; B

Free energy of reaction

ΔrG° (kJ/mol) T (K) Method Reference Comment
33.343.PHPMSChowdhury, 1987gas phase; M

C6H4FNO2- + Formamide, N,N-dimethyl- = (C6H4FNO2- • Formamide, N,N-dimethyl-)

By formula: C6H4FNO2- + C3H7NO = (C6H4FNO2- • C3H7NO)

Quantity Value Units Method Reference Comment
Δr23. ± 6.7kJ/molIMREChowdhury, Grimsrud, et al., 1987gas phase; Free energy affinity at 70°C.; B

Free energy of reaction

ΔrG° (kJ/mol) T (K) Method Reference Comment
23.343.PHPMSChowdhury, 1987gas phase; M

C6H4FNO2- + Acetonitrile = (C6H4FNO2- • Acetonitrile)

By formula: C6H4FNO2- + C2H3N = (C6H4FNO2- • C2H3N)

Quantity Value Units Method Reference Comment
Δr25. ± 6.7kJ/molIMREChowdhury, Grimsrud, et al., 1987gas phase; Free energy affinity at 70°C.; B

Free energy of reaction

ΔrG° (kJ/mol) T (K) Method Reference Comment
25.343.PHPMSChowdhury, 1987gas phase; M

C6H4FNO2- + Silicon tetrafluoride = C6H4F5NO2Si-

By formula: C6H4FNO2- + F4Si = C6H4F5NO2Si-

Quantity Value Units Method Reference Comment
Δr52.3 ± 2.5kJ/molIMREWilliamson, Knighton, et al., 2001gas phase; at 150 C; B

Gas phase thermochemistry data

Data compiled by: John E. Bartmess

Quantity Value Units Method Reference Comment
Δfgas-245. ± 10.kJ/molR-EAChowdhury, Heinis, et al., 1986ΔGea(423 K) = -27.7 kcal/mol, ΔS = -2 eu

References

Chowdhury, Grimsrud, et al., 1987
Chowdhury, S.; Grimsrud, E.P.; Kebarle, P., Bonding of Charged Delocalized Anions to Protic and Dipolar Aprotic Solvent Molecules, J. Phys. Chem., 1987, 91, 10, 2551, https://doi.org/10.1021/j100294a021 . [all data]

Chowdhury, 1987
Chowdhury, S. Grimsrud, Bonding of Charge Delocalized Anions to Protic and Dipolar Aprotic Solvents, J. Phys. Chem., 1987, 91, 10, 2551, https://doi.org/10.1021/j100294a021 . [all data]

Williamson, Knighton, et al., 2001
Williamson, D.H.; Knighton, W.B.; Grimsrud, E.P., Lewis acid-base interactions of SiF4 with molecular anions formed by electron capture reactions, Int. J. Mass Spectrom., 2001, 206, 1-2, 53-61, https://doi.org/10.1016/S1387-3806(00)00388-2 . [all data]