Cyclopentene, 4-(dichloromethylene)-1,2,3,3,5,5-hexachloro-

Condensed phase thermochemistry data

Data compiled by: Hussein Y. Afeefy, Joel F. Liebman, and Stephen E. Stein

Quantity Value Units Method Reference Comment
Δfliquid-94.8 ± 3.7kJ/molCcbLyubarskii and Smolyanets, 1977
Quantity Value Units Method Reference Comment
Δcliquid-2455.8 ± 3.0kJ/molCcbLyubarskii and Smolyanets, 1977

References

Lyubarskii and Smolyanets, 1977
Lyubarskii, M.V.; Smolyanets, R.I., Enthalpies of combustion and formation of five-membered cyclic perchlorohydrocarbons, Vses. Konf. Kalorim. Rasshir. Tezisy Dokl. 7th, 1977, 1, 119-121. [all data]