cyclobutane-1,2-dicarboxylic acid
- Formula: C6H8O4
- Molecular weight: 144.1253
- IUPAC Standard InChIKey: SUSAGCZZQKACKE-UHFFFAOYSA-N
- CAS Registry Number: 3396-14-3
- Chemical structure:
View 3d structure (requires JavaScript / HTML 5) - Stereoisomers:
- Other names: 1,2-Cyclobutanedicarboxylic acid

Phase change data

Data compiled by: Hussein Y. Afeefy, Joel F. Liebman, and Stephen E. Stein
Quantity | Value | Units | Method | Reference | Comment |
---|---|---|---|---|---|
ΔsubH° | 120.0 ± 0.9 | kJ/mol | C | Al-Takhin, Pilcher, et al., 1983 |

References

Al-Takhin, Pilcher, et al., 1983
Al-Takhin, G.; Pilcher, G.; Bickerton, J.,
Standard enthalpies of formation of diamine(dicarboxylato)platinum(II) complexes and of bis(pentane-2,4-dionato)platinum(II): the mean Pt-O bond dissociation enthalpies,
J. Chem. Soc. Dalton Trans., 1983, 2657-2659. [all data]