Methane, bromochlorodinitro-

Phase change data

Data compiled by: Robert L. Brown and Stephen E. Stein

Quantity Value Units Method Reference Comment
Tfus282.3 - 282.4KN/ABuckingham and Donaghy, 1982

Reduced pressure boiling point

Tboil (K) Pressure (atm) Reference
348. - 349.0.020Buckingham and Donaghy, 1982

References

Buckingham and Donaghy, 1982
Buckingham, J.; Donaghy, S.M., Dictionary of Organic Compounds: Fifth Edition, Chapman and Hall, New York, 1982, 1. [all data]