(1,1'-Biphenyl)-4,4'-diamine, N-acetyl-

Reaction thermochemistry data

Data compiled by: Hussein Y. Afeefy, Joel F. Liebman, and Stephen E. Stein

Individual Reactions

N-Acetyl-1,2-diphenylhydrazine = (1,1'-Biphenyl)-4,4'-diamine, N-acetyl-

By formula: C14H14N2O = C14H14N2O

Quantity Value Units Method Reference Comment
Δr-147.2 ± 1.0kJ/molCmPongratz, Bohmert-Sub, et al., 1944solid phase; Heat of transposition

References

Pongratz, Bohmert-Sub, et al., 1944
Pongratz, A.; Bohmert-Sub, S.; Scholtis, K., Zur thermochemie der benzidin-umlagerung, Ber., 1944, 77, 651-735. [all data]