N-Acetylnorvaline methylamide

Condensed phase thermochemistry data

Data compiled by: Eugene S. Domalski and Elizabeth D. Hearing

Constant pressure heat capacity of solid

Cp,solid (J/mol*K) Temperature (K) Reference Comment
239.69298.Abate, Della Gatta, et al., 1991Data extrapolated to 298 K from values obtained at higher temperatures.

References

Abate, Della Gatta, et al., 1991
Abate, L.; Della Gatta, G.; Somsen, G., Heat capacities of solid small peptides by an improved DSC method, Calorim. Anal. Therm., 1991, 22, 233-236. [all data]