Pentaerythrityl tetrachloride

Phase change data

Data compiled as indicated in comments:
BS - Robert L. Brown and Stephen E. Stein
DH - Eugene S. Domalski and Elizabeth D. Hearing

Reduced pressure boiling point

Tboil (K) Pressure (bar) Reference Comment
383.20.016Weast and Grasselli, 1989BS

Enthalpy of phase transition

ΔHtrs (kJ/mol) Temperature (K) Initial Phase Final Phase Reference Comment
22.259368.23crystaline, IIcrystaline, IClever, Wong, et al., 1965DH

Entropy of phase transition

ΔStrs (J/mol*K) Temperature (K) Initial Phase Final Phase Reference Comment
60.45368.23crystaline, IIcrystaline, IClever, Wong, et al., 1965DH

References

Weast and Grasselli, 1989
CRC Handbook of Data on Organic Compounds, 2nd Editon, Weast,R.C and Grasselli, J.G., ed(s)., CRC Press, Inc., Boca Raton, FL, 1989, 1. [all data]

Clever, Wong, et al., 1965
Clever, H.L.; Wong, W-K.; Westrum, E.F., Jr., Heat capacities and thermodynamic properties of globular molecules. XIII. Transition and fusion of pentaerythrityl chloride and bromide, transition of pentaerythrityl iodide, J. Phys. Chem., 1965, 69, 1209-1213. [all data]