3-Hexene, 2,2-dimethyl-
- Formula: C8H16
- Molecular weight: 112.2126
- IUPAC Standard InChIKey: JPLZSSHKQZJYTJ-VOTSOKGWSA-N
- CAS Registry Number: 3123-93-1
- Chemical structure:
View 3d structure (requires JavaScript / HTML 5) - Species with the same structure:
- Stereoisomers:
- Other names: 2,2-Dimethyl-3-hexene; 5,5-Dimethyl-3-hexene; 2,2-dimethylhex-3-ene

Phase change data

Data compiled by: Thermodynamics Research Center, NIST Boulder Laboratories, Chris Muzny director
Quantity | Value | Units | Method | Reference | Comment |
---|---|---|---|---|---|
Tboil | 372.65 | K | N/A | Komarewsky and Shand, 1944 | Uncertainty assigned by TRC = 2. K |
Tboil | 373.25 | K | N/A | Schurman and Boord, 1933 | Uncertainty assigned by TRC = 0.5 K |

References

Komarewsky and Shand, 1944
Komarewsky, V.I.; Shand, W.C.,
Catalytic Aromatization of Branched Aliphatic Hydrocarbons,
J. Am. Chem. Soc., 1944, 66, 1118. [all data]
Schurman and Boord, 1933
Schurman, I.; Boord, C.E.,
Synthesis in teh Olefin Series V. Completing the Survey of the Hexenes and Including Certain Heptenes and Octenes,
J. Am. Chem. Soc., 1933, 55, 4930-5. [all data]