Perfluorotetradecane

Phase change data

Data compiled by: Thermodynamics Research Center, NIST Boulder Laboratories, Chris Muzny director

Quantity Value Units Method Reference Comment
Tfus377.4KN/AJin, Boller, et al., 1994Crystal phase 1 phase; Uncertainty assigned by TRC = 0.2 K
Tfus375.KN/ATwieg and Rabolt, 1988Crystal phase 1 phase; Uncertainty assigned by TRC = 1. K

In addition to the Thermodynamics Research Center (TRC) data available from this site, much more physical and chemical property data is available from the following TRC products:

Kovats' RI, non-polar column, isothermal

View large format table.

Column type Active phase Temperature (C) I Reference Comment
PackedSqualane50.644.Müller, Dietrich, et al., 1983

References

Jin, Boller, et al., 1994
Jin, Y.; Boller, A.; Wunderlich, B.; Lebedev, B.V., Heat capacities and transitions in n-perfluoroalkanes and poly(tetrafluoroethylene), Thermochim. Acta, 1994, 234, 103-25. [all data]

Twieg and Rabolt, 1988
Twieg, R.J.; Rabolt, J.F., Macromolecules, 1988, 21, 1806. [all data]