2-Nonenal, 2-pentyl-
- Formula: C14H26O
- Molecular weight: 210.3556
- IUPAC Standard InChIKey: VIKQYIINCNAGJW-OWBHPGMISA-N
- CAS Registry Number: 3021-89-4
- Chemical structure:
View 3d structure (requires JavaScript / HTML 5) - Species with the same structure:
- Stereoisomers:
- Other names: 2-Amylnon-2-enal; 2-Pentyl-2-nonenal; 2-Pentylnon-2-enal; 2-Amylnonen-2-al; 2-Pentylnonenal

Phase change data

Data compiled by: William E. Acree, Jr., James S. Chickos
Enthalpy of vaporization
ΔvapH (kJ/mol) | Temperature (K) | Method | Reference | Comment |
---|---|---|---|---|
65.7 | 399. | N/A | Mills, Fenton, et al., 1987 | Based on data from 384. to 553. K. |
65.0 | 409. | EB | Mills, Fenton, et al., 1987 | Based on data from 385. to 553. K. |

Condensed phase thermochemistry data

Data compiled by: Eugene S. Domalski and Elizabeth D. Hearing
Constant pressure heat capacity of liquid
Cp,liquid (J/mol*K) | Temperature (K) | Reference | Comment |
---|---|---|---|
435.35 | 323.15 | Mills, Fenton, et al., 1987 | T = 323.15 to 428.15 K. |

References

Mills, Fenton, et al., 1987
Mills, P.L.; Fenton, R.L.; Schaefer, G.F.,
Physical and thermodynamic properties for novel C14 unsaturated aldehydes and C16 saturated amines,
J. Chem. Eng. Data, 1987, 32, 251-265. [all data]