2,2'-diadamantane

Reaction thermochemistry data

Data compiled by: Hussein Y. Afeefy, Joel F. Liebman, and Stephen E. Stein

Individual Reactions

1,1'-diadamantane = 2,2'-diadamantane

By formula: C20H30 = C20H30

Quantity Value Units Method Reference Comment
Δr4.64 ± 0.50kJ/molEqkSlutsky, Engler, et al., 1973liquid phase; solvent: Cyclohexane

2,2'-diadamantane = 1,1'-diadamantane

By formula: C20H30 = C20H30

Quantity Value Units Method Reference Comment
Δr4.64 ± 0.50kJ/molEqkSlutsky, Engler, et al., 1973liquid phase

References

Slutsky, Engler, et al., 1973
Slutsky, J.; Engler, E.M.; Schleyer, P.v.R., Equilibration of biadamantane isomers, J. Chem. Soc. Chem. Commun., 1973, 685-686. [all data]