Cholest-6-ene
- Formula: C27H46
- Molecular weight: 370.6541
- IUPAC Standard InChIKey: IUWNUFNRBABFDB-UHFFFAOYSA-N
- CAS Registry Number: 28338-70-7
- Chemical structure:
View 3d structure (requires JavaScript / HTML 5) - Permanent link for this species. Use this link for bookmarking this species for future reference.

Reaction thermochemistry data

Data compiled by: Hussein Y. Afeefy, Joel F. Liebman, and Stephen E. Stein
Individual Reactions
By formula: H2 + C27H46 = C27H48
Quantity | Value | Units | Method | Reference | Comment |
---|---|---|---|---|---|
ΔrH° | -114.5 ± 0.4 | kJ/mol | Chyd | Turner, Meador, et al., 1957 | liquid phase; solvent: Acetic acid |

References

Turner, Meador, et al., 1957
Turner, R.B.; Meador, W.R.; Winkler, R.E.,
Heats of hydrogenation. II. Heats of hydrogenation and the acid-catalyzed isomerization of some unsaturated steroids,
J. Am. Chem. Soc., 1957, 79, 4122-4127. [all data]