1H-Inden-1-one, octahydro-, cis-

Condensed phase thermochemistry data

Data compiled by: Hussein Y. Afeefy, Joel F. Liebman, and Stephen E. Stein

Quantity Value Units Method Reference Comment
Δcliquid-5214.9kJ/molCcbHuckel and Friedrich, 1926Corresponding Δfliquid = -328. kJ/mol (simple calculation by NIST; no Washburn corrections)

References

Huckel and Friedrich, 1926
Huckel, W.; Friedrich, H., Zur Stereochemie bicyclischer Ringsytem III: Die Stereoisomerie des Hydrindans und seiner Derivate I, Ann., 1926, 451, 132-160. [all data]