e-(Phenylazo)propane
- Formula: C9H12N2
- Molecular weight: 148.2050
- IUPAC Standard InChIKey: JGHVTEUPGALIRE-KHPPLWFESA-N
- CAS Registry Number: 28053-14-7
- Chemical structure:
View 3d structure (requires JavaScript / HTML 5) - Permanent link for this species. Use this link for bookmarking this species for future reference.

Reaction thermochemistry data

Data compiled by: Hussein Y. Afeefy, Joel F. Liebman, and Stephen E. Stein
Individual Reactions
By formula: C9H12N2 = C9H12N2
Quantity | Value | Units | Method | Reference | Comment |
---|---|---|---|---|---|
ΔrH° | -23. | kJ/mol | Cm | Engel, Wang, et al., 1993 | solid phase; Tautomerization |

References

Engel, Wang, et al., 1993
Engel, P.S.; Wang, C.; Chen, Y.; Ruchardt, C.; Beckhaus, H.-D.,
Synthesis, thermochemistry, and reactions of vicinal bis(azoalkanes). The chemistry α- and β-azo radicals,
J. Am. Chem. Soc., 1993, 115, 65-74. [all data]