3,3,5,5-Tetramethyl-1-pyrazoline

Phase change data

Data compiled as indicated in comments:
ALS - Hussein Y. Afeefy, Joel F. Liebman, and Stephen E. Stein
DRB - Donald R. Burgess, Jr.
AC - William E. Acree, Jr., James S. Chickos

Quantity Value Units Method Reference Comment
Δsub61.6 ± 0.2kJ/molVEngel, Melaugh, et al., 1976ALS
Δsub61.3kJ/molN/AEngel, Melaugh, et al., 1976DRB
Δsub61.6 ± 0.2kJ/molN/AEngel, Melaugh, et al., 1976AC

Gas phase thermochemistry data

Data compiled by: Hussein Y. Afeefy, Joel F. Liebman, and Stephen E. Stein

Quantity Value Units Method Reference Comment
Δfgas9.4 ± 0.8kcal/molCcbEngel, Melaugh, et al., 1976

References

Engel, Melaugh, et al., 1976
Engel, P.S.; Melaugh, R.A.; Mansson, M.; Timberlake, J.W.; Garner, A.W.; Rossini, F.D., Thermochemistry of nine diazenes (azo compounds), J. Chem. Thermodyn., 1976, 8, 607-621. [all data]