Ni(CO)3

Reaction thermochemistry data

Data compiled by: José A. Martinho Simões

Individual Reactions

C3N2NiO3 (solution) = C3NiO3 (solution) + Nitrogen (solution)

By formula: C3N2NiO3 (solution) = C3NiO3 (solution) + N2 (solution)

Quantity Value Units Method Reference Comment
Δr42. ± 4.kJ/molKinSTurner, Simpson, et al., 1983solvent: Liquid krypton; The reaction enthalpy relies on the experimental value for the activation enthalpy, 42. ± 4. kJ/mol, and on the assumption that the activation enthalpy for product recombination is negligible Turner, Simpson, et al., 1983.

Nickel tetracarbonyl (solution) = C3NiO3 (solution) + Carbon monoxide (solution)

By formula: C4NiO4 (solution) = C3NiO3 (solution) + CO (solution)

Quantity Value Units Method Reference Comment
Δr94.6kJ/molKinSTurner, Simpson, et al., 1983solvent: Liquid krypton; The reaction enthalpy relies on the experimental value for the activation enthalpy, 94.6 kJ/mol, and on the assumption that the activation enthalpy for product recombination is negligible Turner, Simpson, et al., 1983.

Nickel tetracarbonyl (g) = C3NiO3 (g) + Carbon monoxide (g)

By formula: C4NiO4 (g) = C3NiO3 (g) + CO (g)

Quantity Value Units Method Reference Comment
Δr104. ± 8.kJ/molN/AStevens, Feigerle, et al., 1982Please also see Compton and Stockdale, 1976. The enthalpy of formation relies on -602.5 ± 2.6 kJ/mol for the enthalpy of formation of Ni(CO)4(g) Method: LPS and collision with low energy electrons.

C3NiO3 (g) = C2NiO2 (g) + Carbon monoxide (g)

By formula: C3NiO3 (g) = C2NiO2 (g) + CO (g)

Quantity Value Units Method Reference Comment
Δr118.3 ± 9.8kJ/molFA-SIFTSunderlin, Wang, et al., 1992
Δr55. ± 42.kJ/molN/AStevens, Feigerle, et al., 1982Please also see Compton and Stockdale, 1976. Method: LPS and collision with low energy electrons.

References

Turner, Simpson, et al., 1983
Turner, J.J.; Simpson, M.B.; Poliakoff, M.; Maier II, W.B., J. Am. Chem. Soc., 1983, 105, 3898. [all data]

Stevens, Feigerle, et al., 1982
Stevens, A.E.; Feigerle, C.S.; Lineberger, W.C., Laser Photoelectron Spectrometry of Ni(CO)n-, n=1-3, J. Am. Chem. Soc., 1982, 104, 19, 5026, https://doi.org/10.1021/ja00383a004 . [all data]

Compton and Stockdale, 1976
Compton, R.N.; Stockdale, J.A.D., Formation of gas phase negative ions in Fe(CO)5 and Ni(CO)4, Int. J. Mass Spectrom. Ion Phys., 1976, 22, 47. [all data]

Sunderlin, Wang, et al., 1992
Sunderlin, L.S.; Wang, D.; Squires, R.R., Metal Carbonyl Bond Strengths in Fe(CO)n- and Ni(CO)n-, J. Am. Chem. Soc., 1992, 114, 8, 2788, https://doi.org/10.1021/ja00034a004 . [all data]