Benzonitrile, 2,4,6-trimethyl-

Gas phase thermochemistry data

Data compiled by: Hussein Y. Afeefy, Joel F. Liebman, and Stephen E. Stein

Quantity Value Units Method Reference Comment
Δfgas106.4 ± 2.3kJ/molCcbAcree, Tucker, et al., 1991
Δfgas84.5 ± 3.0kJ/molCcbMeier, Dogan, et al., 1987

References

Acree, Tucker, et al., 1991
Acree, W.E., Jr.; Tucker, S.A.; Zvaigzne, A.I.; Meng-Yan, Y.; Pilcher, G.; Ribeiro Da Silva, M.D.M., Enthalpies of combustion of 2,4,6-trimethylbenzonitrile, 2,4,6-trimethylbenzonitrile N-oxide,, 2,6-dimethylbenzonitrile, 2,4,6-trimethoxybenzonitrile, and 2,4,6-trimethoxybenzonitrile N-oxide: the dissociation enthalpies of the (N-O) bonds, J. Chem. Thermodyn., 1991, 23, 31-36. [all data]

Meier, Dogan, et al., 1987
Meier, M.; Dogan, B.; Beckhaus, H.; Ruchardt, C., Heats of formation and heats of isomerization of isocyanides, New J. Chem., 1987, 11, 1-6. [all data]