4-Chloromethyl-1,3-dioxolan-2-one
- Formula: C4H5ClO3
- Molecular weight: 136.534
- IUPAC Standard InChIKey: LFEAJBLOEPTINE-UHFFFAOYSA-N
- CAS Registry Number: 2463-45-8
- Chemical structure:
View 3d structure (requires JavaScript / HTML 5) - Permanent link for this species. Use this link for bookmarking this species for future reference.

Condensed phase thermochemistry data

Data compiled by: Eugene S. Domalski and Elizabeth D. Hearing
Constant pressure heat capacity of liquid
Cp,liquid (J/mol*K) | Temperature (K) | Reference | Comment |
---|---|---|---|
248. | 298. | Masood, Pethrick, et al., 1976 | T = 200 to 320 K. Data graphically only. Value estimated from graph. |

References

Masood, Pethrick, et al., 1976
Masood, A.K.M.; Pethrick, R.A.; Swinton, F.L.,
Physicochemical studies of super-cooled liquids. Cyclic carbonates and a-β-unsaturated aldehydes,
J. Chem. Soc. Faraday Trans. I, 1976, 72, 20-28. [all data]