2H-1-Benzopyran-2-one, 3-methyl-
- Formula: C10H8O2
- Molecular weight: 160.1693
- IUPAC Standard InChIKey: VIIIJFZJKFXOGG-UHFFFAOYSA-N
- CAS Registry Number: 2445-82-1
- Chemical structure:
View 3d structure (requires JavaScript / HTML 5) - Other names: Coumarin, 3-methyl-; 3-Methylcoumarin; 3-Methylcumarin; 3-Methyl-2H-1-benzopyran-2-one

Phase change data

Data compiled by: Robert L. Brown and Stephen E. Stein
Quantity | Value | Units | Method | Reference | Comment |
---|---|---|---|---|---|
Tboil | 565.7 | K | N/A | Weast and Grasselli, 1989 |

Normal alkane RI, non-polar column, custom temperature program

Column type | Active phase | I | Reference | Comment |
---|---|---|---|---|
Capillary | SE-30 | 1490. | Vinogradov, 2004 | Program: not specified |
Capillary | OV-101 | 1490. | Shibamoto, 1987 | Program: not specified |

Normal alkane RI, polar column, custom temperature program

Column type | Active phase | I | Reference | Comment |
---|---|---|---|---|
Capillary | Carbowax 20M | 2424. | Vinogradov, 2004 | Program: not specified |
Capillary | Carbowax 20M | 2424. | Shibamoto, 1987 | Program: not specified |

References

Weast and Grasselli, 1989
CRC Handbook of Data on Organic Compounds, 2nd Editon, Weast,R.C and Grasselli, J.G., ed(s)., CRC Press, Inc., Boca Raton, FL, 1989, 1. [all data]