3-ethyl-2-hexanol

Phase change data

Data compiled by: Thermodynamics Research Center, NIST Boulder Laboratories, Chris Muzny director

Quantity Value Units Method Reference Comment
Tboil441.15KN/AClarke and Riegel, 1912Uncertainty assigned by TRC = 3. K

In addition to the Thermodynamics Research Center (TRC) data available from this site, much more physical and chemical property data is available from the following TRC products:

References

Clarke and Riegel, 1912
Clarke, L.; Riegel, E.R., 3-ethylhexane, J. Am. Chem. Soc., 1912, 34, 674. [all data]