5,6-Dihydro-6-methyluracil
- Formula: C5H8N2O2
- Molecular weight: 128.1292
- IUPAC Standard InChIKey: XQLIRTZXJDEQAO-UHFFFAOYSA-N
- CAS Registry Number: 2434-49-3
- Chemical structure:
View 3d structure (requires JavaScript / HTML 5) - Other names: 2,4(1H,3H)-Pyrimidinedione, dihydro-6-methyl-; Dihydro-6-methyluracil; Hydrouracil, 6-methyl-; Metacil, dihydro-; 4-Methyldihydrouracil; 6-Methyl-5,6-dihydrouracil; 6-Methyldihydrouracil; 6-Methyldihydro-2,4(1H,3H)-pyrimidinedione; NSC 44127

Condensed phase thermochemistry data

Data compiled by: Hussein Y. Afeefy, Joel F. Liebman, and Stephen E. Stein
Quantity | Value | Units | Method | Reference | Comment |
---|---|---|---|---|---|
ΔcH°solid | -2592. | kJ/mol | Ccb | Fischer and Wrede, 1904 | Heat of combustion corrected for pressure |
ΔcH°solid | -2592.4 | kJ/mol | Ccb | Lemoult, 1904 |

References

Fischer and Wrede, 1904
Fischer, E.; Wrede, F.,
Uber die Verbrennungswarme einiger organischer Verbindungen,
Sitzungsber. Dtsch. Akad. Wiss. Berlin Kl. Math. Phys. Tech., 1904, 687-715. [all data]
Lemoult, 1904
Lemoult, M.P.,
Remarques sur une serie recenie de determinations calorimetriques,
Compt. Rend., 1904, 663-635. [all data]