Ether, α,α-dimethylbenzyl propyl

Phase change data

Data compiled by: William E. Acree, Jr., James S. Chickos

Quantity Value Units Method Reference Comment
Δvap59.3 ± 0.2kJ/molGSVerevkin and Heintz, 2001Based on data from 278. - 325. K.

Enthalpy of vaporization

ΔvapH (kJ/mol) Temperature (K) Method Reference Comment
59.1 ± 0.2302.GSVerevkin and Heintz, 2001Based on data from 278. - 325. K.

References

Verevkin and Heintz, 2001
Verevkin, Sergey P.; Heintz, Andreas, Chemical Equilibria Study of the Reacting System of the Alkyl Cumyl Ether Synthesis from n -Alkanols and α-Methylstyrene, J. Chem. Eng. Data, 2001, 46, 1, 41-46, https://doi.org/10.1021/je000162a . [all data]