Hexadecanoic acid, 2-hydroxy-1-(hydroxymethyl)ethyl ester

Condensed phase thermochemistry data

Data compiled as indicated in comments:
ALS - Hussein Y. Afeefy, Joel F. Liebman, and Stephen E. Stein
DH - Eugene S. Domalski and Elizabeth D. Hearing

Quantity Value Units Method Reference Comment
Δfsolid-1222.1 ± 3.1kJ/molCcbSilbert, Daubert, et al., 1965Heat of formation derived by Cox and Pilcher, 1970; ALS
Δfsolid-1239.8kJ/molCcbClarke and Stegeman, 1940ALS
Quantity Value Units Method Reference Comment
Δcsolid-11685.3 ± 2.8kJ/molCcbSilbert, Daubert, et al., 1965Heat of formation derived by Cox and Pilcher, 1970; Corresponding Δfsolid = -1222.2 kJ/mol (simple calculation by NIST; no Washburn corrections); ALS
Δcsolid-11666.2 ± 2.8kJ/molCcbClarke and Stegeman, 1940Corresponding Δfsolid = -1241.2 kJ/mol (simple calculation by NIST; no Washburn corrections); ALS

Constant pressure heat capacity of solid

Cp,solid (J/mol*K) Temperature (K) Reference Comment
558.6298.Silbert, Daubert, et al., 1965DH
607.1298.Clarke and Stegeman, 1940DH

References

Silbert, Daubert, et al., 1965
Silbert, L.S.; Daubert, B.F.; Mason, L.S., The heats of combustion, formation, and isomerization of isomeric monoglycerides, J. Phys. Chem., 1965, 69, 2887-2894. [all data]

Cox and Pilcher, 1970
Cox, J.D.; Pilcher, G., Thermochemistry of Organic and Organometallic Compounds, Academic Press, New York, 1970, 1-636. [all data]

Clarke and Stegeman, 1940
Clarke, T.H.; Stegeman, G., α- And β-monopalmitin, heats of combustion and specific heats at 25°, J. Am. Chem. Soc., 1940, 62, 1815-1817. [all data]