Boron monofluoride monoxide

Reaction thermochemistry data

Data compiled by: Michael M. Meot-Ner (Mautner) and Sharon G. Lias

Individual Reactions

Fluorine anion + BFO = (Fluorine anion • BFO)

By formula: F- + BFO = (F- • BFO)

Quantity Value Units Method Reference Comment
Δr200. ± 10.kJ/molICRLarson and McMahon, 1987gas phase; bracketing

Ion clustering data

Data compiled by: Michael M. Meot-Ner (Mautner) and Sharon G. Lias

Clustering reactions

Fluorine anion + BFO = (Fluorine anion • BFO)

By formula: F- + BFO = (F- • BFO)

Quantity Value Units Method Reference Comment
Δr200. ± 10.kJ/molICRLarson and McMahon, 1987gas phase; bracketing

Gas phase thermochemistry data

Quantity Value Units Method Reference Comment
Δfgas-144.00kcal/molReviewChase, 1998Data last reviewed in December, 1965
Quantity Value Units Method Reference Comment
gas,1 bar53.728cal/mol*KReviewChase, 1998Data last reviewed in December, 1965

Gas Phase Heat Capacity (Shomate Equation)

Cp° = A + B*t + C*t2 + D*t3 + E/t2
H° − H°298.15= A*t + B*t2/2 + C*t3/3 + D*t4/4 − E/t + F − H
S° = A*ln(t) + B*t + C*t2/2 + D*t3/3 − E/(2*t2) + G
    Cp = heat capacity (cal/mol*K)
    H° = standard enthalpy (kcal/mol)
    S° = standard entropy (cal/mol*K)
    t = temperature (K) / 1000.

View plot Requires a JavaScript / HTML 5 canvas capable browser.

View table.

Temperature (K) 298. - 800.800. - 6000.
A 6.56966114.06040
B 15.030200.515621
C -11.38740-0.111865
D 3.3488410.008176
E -0.029266-0.934969
F -146.6310-150.6950
G 57.5103067.04510
H -144.0000-144.0000
ReferenceChase, 1998Chase, 1998
Comment Data last reviewed in December, 1965 Data last reviewed in December, 1965

Gas phase ion energetics data

Data compiled as indicated in comments:
LLK - Sharon G. Lias, Rhoda D. Levin, and Sherif A. Kafafi
RDSH - Henry M. Rosenstock, Keith Draxl, Bruce W. Steiner, and John T. Herron

Ionization energy determinations

IE (eV) Method Reference Comment
14. ± 1.EIUy, Srivastava, et al., 1971LLK
13.4 ± 0.5EIHildenbrand, Theard, et al., 1963RDSH

References

Larson and McMahon, 1987
Larson, J.W.; McMahon, T.B., Trends in Gas Phase Fluoride Ion Affinities of the Main Group Oxyfluorides and Fluoride Sulfides. Fluoride Adducts of FAsO, FPO, FPO2, F2SiO, F4SO, FBO, F2SiS, FPS, FAsS, F2S2, and S2O., Inorg. Chem., 1987, 26, 24, 4018, https://doi.org/10.1021/ic00271a011 . [all data]