Spiro[4.5]decane, 7-hexadecyl-

Condensed phase thermochemistry data

Data compiled by: Hussein Y. Afeefy, Joel F. Liebman, and Stephen E. Stein

Quantity Value Units Method Reference Comment
Δfliquid-590.4 ± 2.4kJ/molCcbSubach and Zwolinski, 1975
Quantity Value Units Method Reference Comment
Δcliquid-16786.5 ± 2.2kJ/molCcbSubach and Zwolinski, 1975Corresponding Δfliquid = -590.49 kJ/mol (simple calculation by NIST; no Washburn corrections)

References

Subach and Zwolinski, 1975
Subach, D.J.; Zwolinski, B.J., Enthalpies of combustion, formation, and vaporization of spiro[4,5]decane, spiro[5,5]undecane, and 7-n-Hexadecylspiro[4,5]decane, J. Chem. Eng. Data, 1975, 20, 232-235. [all data]