1H-Pyrrole-2-carboxylic acid, 3,5-dimethyl-, ethyl ester

Condensed phase thermochemistry data

Data compiled by: Hussein Y. Afeefy, Joel F. Liebman, and Stephen E. Stein

Quantity Value Units Method Reference Comment
Δfsolid-474.5 ± 5.0kJ/molCcbRothemund and Beyer, 1932Reanalyzed by Cox and Pilcher, 1970, Original value = -464.8 ± 5.0 kJ/mol; Author's Hf=-116.1±1.20
Quantity Value Units Method Reference Comment
Δcsolid-4925.0 ± 5.0kJ/molCcbRothemund and Beyer, 1932Reanalyzed by Cox and Pilcher, 1970, Original value = -4934.6 ± 5.0 kJ/mol; Author's Hf=-116.1±1.20

Gas phase ion energetics data

Data compiled as indicated in comments:
LLK - Sharon G. Lias, Rhoda D. Levin, and Sherif A. Kafafi

Ionization energy determinations

IE (eV) Method Reference Comment
7.91PECauletti, Giancaspro, et al., 1981Vertical value; LLK

References

Rothemund and Beyer, 1932
Rothemund, P.; Beyer, H., Calorimetrische bestimmungen bei einfachen pyrrolen, Ann. Chim., 1932, 492, 292-298. [all data]

Cox and Pilcher, 1970
Cox, J.D.; Pilcher, G., Thermochemistry of Organic and Organometallic Compounds, Academic Press, New York, 1970, 1-636. [all data]